{"text_format":"1","workbook":"xlsx","n_sheets":6,"sheets":["Devis 2021","OO","Sécu","taux LOA","trad","indices"],"not_rendered":{"charts":0,"images":5,"macros":1,"external_links":1,"defined_names":4,"comments":1,"pivot_tables":0},"unopened":[],"bounds":{"document_bytes":16777216,"sheet_cells":100000,"rows_first":2000,"rows_last":500,"rows_between":2000,"halvings":0,"cell_chars":16384,"cell_head_chars":4096},"cells_cut":0,"cells_raw":0,"read":"whole","date_system":"1900"}

{"sheet":"Devis 2021","index":0,"n_rows":77,"n_cols":20,"rows_kept":77,"cut":false,"hidden":false,"merged":[[79,5,79,6],[3,6,4,6],[4,8,6,8],[7,2,7,3],[6,2,6,3],[14,3,15,11],[16,3,17,11]]}
[]
[null,null,null,null,null,null,{"$f":"IF($C$11<>\"\",trad!G2,IF(C13<>\"\",trad!K2,trad!C2))","v":"Demande de devis"}]
[]
[null,null,null,null,null,null,null,{"$f":"IF($C$11<>\"\",trad!G93,IF($C$13<>\"\",trad!K93,trad!C93))","v":"Monsieur :"}]
[null,null,null,null,null,null,null,{"$f":"IF($C$11<>\"\",trad!G94,IF($C$13<>\"\",trad!K94,trad!C94))","v":"Adresse : "}]
[]
[null,{"$f":"IF($C$11<>\"\",trad!F2,IF($C$13<>\"\",trad!J2,trad!B2))","v":"à : "},"TREGUNC"]
[null,{"$f":"IF($C$11<>\"\",trad!F3,IF($C$13<>\"\",trad!J3,trad!B3))","v":"le : "},null,null,null,null,null,{"$f":"IF($C$11<>\"\",trad!G95,IF($C$13<>\"\",trad!K95,trad!C95))","v":"Tel : "}]
[null,null,null,null,null,null,null,{"$f":"IF($C$11<>\"\",trad!G96,IF($C$13<>\"\",trad!K96,trad!C96))","v":"Email : "}]
[]
[null,null,null,null,null,null,null,{"$f":"IF($C$11<>\"\",trad!G97,IF($C$13<>\"\",trad!K97,trad!C97))","v":"Votre bateau :"}]
[null,null,null,null,null,null,null,{"$f":"IF($C$11<>\"\",trad!G98,IF($C$13<>\"\",trad!K98,trad!C98))","v":"Port d'attache :"}]
[]
[]
[null,null,null,{"$f":"IF($C$11<>\"\",trad!F6,IF($C$13<>\"\",trad!J6,trad!B6))","v":"Virgin Mojito 650 QR standard suivant descriptif - Complétez vos coordonnées, sélectionnez les options."}]
[]
[null,null,null,{"$f":"IF($C$11<>\"\",trad!F7,IF($C$13<>\"\",trad!J7,trad!B7))","v":"Sauvegardez, cliquez sur l'enveloppe pour envoyer à info@idbmarine.com"}]
[]
[null,null,null,"Équipements optionnels ( pose comprise)","Colonne1","Colonne2","Colonne3","Colonne32","Colonne4","Colonne6","Colonne7","Colonne9"]
[null,null,null,null,"Energie - Propulsion"]
[null,null,null,null,null,"Kit électrique comprenant : ",null,null,null,null,1140]
[null,null,null,null,null,"                    1 Tableau électrique 5 positions sur disjonteurs",null,null,"",null,""]
[null,null,null,null,null,"                    1 batterie plomb AGM 80 AH ou convertisseur DC DC",null,null,"",null,""]
[null,null,null,null,null,"                    1 coupe circuit",null,null,"",null,""]
[null,null,null,null,null,"                    1 plafonnier rouge / blanc",null,null,"",null,""]
[null,null,null,null,null,"                    2 rampes LED ( sur équipets latéraux)",null,null,"",null,""]
[null,null,null,null,null,"                    1 feux de Nav / Mouillage Tiny en tête de mât"]
[null,null,null,null,null,"Panneaux solaire sur avant roof (2 * 77 w)",null,null,null,null,""]
[null,null,null,null,null,"Moteur thermique Honda 2,5 cv",null,null,null,null,""]
[null,null,null,null,null,"Moteur thermique Suzuki DF4 avec nourrice",null,null,null,null,""]
[null,null,null,null,null,"Moteur HB Torquedo Cruise 2.0 RS + batterie Power 24-3500",null,null,null,null,""]
[null,null,null,null,null,"Hydrogénérateur W&S PK Mini 300 K sur tableau",null,null,null,null,""]
[null,null,null,null,null,null,null,null,"",null,""]
[null,null,null,null,"Voiles All Purpose"]
[null,null,null,null,"Près"]
[null,null,null,null,null,"Grand voile lattée à corne / 21 m² - CDX6 - 2 Ris auto",null,null,null,null,3162]
[null,null,null,null,null,"Solent 110 % - CDX6 - 17 m²",null,null,null,null,1722]
[null,null,null,null,null,"Code 0 23 m2 Trilam SG-TPEN 60 ",null,null,null,null,""]
[null,null,null,null,"Portant"]
[null,null,null,null,null,"Spi assymétrique / 64.00 m² - A2",null,null,null,null,2418]
[null,null,null,null,null,"Gennaker / 30.00 m²",null,null,null,null,""]
[null,null,null,null,"Divers"]
[null,null,null,null,null,"Lazy Bag",null,null,null,null,510]
[null,null,null,null,null,"Taud de GV",null,null,null,null,408]
[null,null,null,null,null,null,null,null,null,null,""]
[null,null,null,null,"Electronique",null,null,null,null,null,""]
[null,null,null,null,null,"B&G Triton (électronique croisière rapide)",null,null,null,null,9818]
[null,null,null,null,null,"NKE (électronique course type Maxi 650)",null,null,null,null,""]
[]
[null,null,null,null,"Equipements / Divers",null,null,null,null,null,null,null,null,null,null,null,null,null,null,""]
[null,null,null,null,null,"Béquilles télescopiques",null,null,null,null,1800,null,null,null,null,null,null,null,null,""]
[null,null,null,null,null,"Enrouleur FD 110",null,null,null,null,540]
[null,null,null,null,null,"Emmagasineur facnor Fx1500",null,null,null,null,951]
[null,null,null,null,null,"Emmagasineur Karver KF 1,5",null,null,null,null,""]
[null,null,null,null,null,"2 winchs Karver KCW45 aulieu de 3 winchs Harken Radial20 Alu",null,null,null,null,""]
[null,null,null,null,null,"Mat + bôme carbone",null,null,null,null,1800,null,null,null,null,null,null,null,null,""]
[null,null,null,null,null,"Jupe arrière (40 cm) avec chaise moteur intégrée et echelle de bain"]
[null,null,null,null,null,"Kit armement côtier"]
[null,null,null,null,null,"Kit armement semi-hauturier"]
[null,null,null,null,null,"Kit Emménagements Week End"]
[null,null,null,null,null,null,"Table de carré avec deux abattants"]
[null,null,null,null,null,null,"Selleries de couchage AV et AR"]
[null,null,null,null,null,"Kit Emménagements Croisière"]
[null,null,null,null,null,null,"Module cuisine (évier + réchaud 1 feu)"]
[null,null,null,null,null,null,"WC Chimique"]
[null,null,null,null,null,"Kit Outils Océan : voir onglet OO",null,null,null,null,1800]
[null,null,null,null,null,"Chaise moteur HB sur tableau AR"]
[null,null,null,null,null,"Coque couleur (adhésif)"]
[null,null,null,null,null,"Préparation carène (Primaire + AF érodable)",null,null,null,null,1110,null,null,null,null,null,null,null,null,""]
[null,null,null,null,null,"Préparation carène (Coppercoat)",null,null,null,null,180,null,null,null,null,null,null,null,null,""]
[null,null,null,null,null,"Remorque Mécanorem pour Mojito 650 (avec conformateurs)",null,null,null,null,"",null,null,null,null,null,null,null,null,""]
[null,null,null,null,null,"Remorque portuaire Mécanorem pour Mojito 650 (avec conformateurs)",null,null,null,null,2160,null,null,null,null,null,null,null,null,""]
[null,null,null,null,null,"Chargement et sanglage bateau + mât sur remorque Mojito 650",null,null,null,null,8136,null,null,null,null,null,null,null,null,""]
[null,null,null,null,null,"Mise à l'eau & mâtage (à Concarneau)",null,null,null,null,"",null,null,null,null,null,null,null,null,""]
[null,null,null,null,null,"Essai sous voiles (1 journée)",null,null,null,null,2760,null,null,null,null,null,null,null,null,""]
[null,null,null,null,null,"Participation eco conception (%)",null,null,null,null,720,null,null,null,null,null,null,null,null,""]
[null,null,null,null,null,"Frais d'immatriculation (hors cout francisation)",null,null,null,null,363]

{"sheet":"OO","index":1,"n_rows":37,"n_cols":11,"rows_kept":37,"cut":false,"hidden":false,"merged":[[2,6,3,10]]}
[]
[]
[null,null,null,null,null,null,"Kit Outils Ocean pour Maxi 650"]
[]
[]
[]
[]
[]
[null,"Par-battage : PB264610",null,null,null,null,null,null,null,"Baille à bouts : T403110"]
[null,null,"Dimensions : L26 x H46 x Ep10 cm",null,null,null,null,null,null,null,"Dimensions : L40 x H31 x E10"]
[null,null,"Aménagements",null,null,null,null,null,null,null,"Aménagements :"]
[null,null,"- Housse composée de 4 pièces de tissu, liaison par glissière,",null,null,null,null,null,null,null,"- ouverture de type béante,"]
[null,null,"- 4 Ancrages aux angles",null,null,null,null,null,null,null,"- latte de renfort et fixation,"]
[null,null,"- 1 face en bâche, 1 face en feutre polyester",null,null,null,null,null,null,null,"- système de fixation rapide."]
[null,null,"Matériaux:",null,null,null,null,null,null,null,"Matériaux :"]
[null,null,"- Tissu polyester enduit PVC, feutre polyester",null,null,null,null,null,null,null,"- corps en polyester enduit PVC 2 faces,"]
[null,null,"- Mousse PE 30kg/m 3",null,null,null,null,null,null,null,"- dessous en polyester ajouré enduit PVC,"]
[null,null,"- Sangle en polypropylène",null,null,null,null,null,null,null,"- renfort en polyéthylène 18/10 ème."]
[null,null,"Couleur : Marine, blanc ou gris",null,null,null,null,null,null,null,"- bordure en Sangle polypropylène."]
[null,"Quantité : 4",null,null,null,null,null,null,null,null,"Coloris : blanc"]
[null,null,null,null,null,null,null,null,null,"Quantité : 2"]
[]
[]
[null,"Baille à bouts : TS302515",null,null,null,null,null,null,null,"Baille à manivelle : RMW2"]
[null,null,"Dimensions : L30 x H25 x E15",null,null,null,null,null,null,null,"Dimensions : L 10 x H 35 x E 07 cm"]
[null,null,"Aménagements :",null,null,null,null,null,null,null,"Aménagements"]
[null,null,"- fermeture par sandow,",null,null,null,null,null,null,null,"- gousset avec ouverture béante et 2 découpes,"]
[null,null,"- latte de renfort et fixation,",null,null,null,null,null,null,null,"- système de fixation rapide ."]
[null,null,"- système de fixation rapide.",null,null,null,null,null,null,null,"Matériaux :"]
[null,null,"Matériaux :",null,null,null,null,null,null,null,"- dos en polyéthylène 18/10eme (NOIR),"]
[null,null,"- corps en polyester ajouré enduit PVC,",null,null,null,null,null,null,null,"- corps en polyester enduit PVC 2 faces (BLANC),"]
[null,null,"- soufflet en polyester enduit PVC 2 faces,",null,null,null,null,null,null,null,"- renfort de l’ouverture en mousse EVA,"]
[null,null,"- fermeture par sandow de qualité marine,",null,null,null,null,null,null,null,"- bordure en Sangle polypropylène."]
[null,null,"- renfort en polyéthylène 18/10 ème.",null,null,null,null,null,null,null,"Coloris : blanc"]
[null,null,"- bordure en Sangle polypropylène.",null,null,null,null,null,null,"Quantité : 2"]
[null,null,"Coloris : blanc"]
[null,"Quantité : 2"]

{"sheet":"Sécu","index":2,"n_rows":21,"n_cols":6,"rows_kept":21,"cut":false,"hidden":false,"merged":[[25,3,28,5]]}
[]
[]
[null,null,null,"Armement Sécurité Mojito 650","Côtier","Semi Hauturier"]
[]
[null,null,"ref","Désignation","nb","nb"]
[null,null,63429,"GILET GF Pilot 165 AUTO PS+HARN NOIR+SC",4,4]
[null,null,65558,"FEU FLASH JACKA1 AUTO SOLAS ALCAL.+CLIP",4,4]
[null,null,55983,"LONGE SIMPLE 2 MOUSQ DBLE SECU",null,4]
[null,null,35713,"RESCUE SLING BLANC",null,1]
[null,null,39448,"LIGNE DE VIE 5 M Blanche",null,1]
[null,null,14375,"SEAU PLASTIQ.ANSE A OEIL",1,1]
[null,null,44676,"ECOPE",1,1]
[null,null,57508,"EXTINCTEUR MARINE 1 KG",1,1]
[null,null,66003,"TROUSSE SECOURS OFFSHORE/FLUVIAL",null,1]
[null,null,61695,"COFFRET PLAISANCE",null,1]
[null,null,64376,"POCHETTE PAVILLONS N/C/N 45x30",null,1]
[null,null,62094,"GAFFE ALU TEL",null,1]
[null,null,65537,"LAMPE TORCHE ETANCHE LED ORANGE",null,1]
[null,null,58415,"JOURNAL DE BORD BILINGUE",null,1]
[null,null,46566,"MOUILLAGE KOBRA 6kg",1,1]
[null,null,null,"Bloc Côtier",1,1]

{"sheet":"taux LOA","index":3,"n_rows":15,"n_cols":10,"rows_kept":15,"cut":false,"hidden":true,"merged":[]}
[]
[null,"2016-10-01"]
[]
[null,"%",3,4,5,6,7,10,12,15]
["L"]
["O",0.3,1.8734999999999999,1.4129,1.1253,0.95109999999999995,0.82830000000000004,0.61080000000000001,0.54669999999999996,0.46920000000000001]
["A",0.4,1.5696000000000001,1.1838,0.94279999999999997,0.79679999999999995,0.69389999999999996,0.51180000000000003,0.45800000000000002,0.3931]
[null,0.5,1.2602,0.94810000000000005,0.75570000000000004,0.63790000000000002,0.55489999999999995,0.41660000000000003,0.36130000000000001]
[]
[]
["Assurance",100000,{"$f":"IF(#REF!>'taux LOA'!B11,IF(#REF!<'taux LOA'!B12,1,0),0)","v":{"$error":"#REF!"}},6.7500000000000004E-4]
[null,150000,{"$f":"IF(#REF!>'taux LOA'!B12,IF(#REF!<'taux LOA'!B13,1,0),0)","v":{"$error":"#REF!"}},5.9999999999999995E-4]
[null,200000,{"$f":"IF(#REF!>'taux LOA'!B13,IF(#REF!<'taux LOA'!B14,1,0),0)","v":{"$error":"#REF!"}},5.6749999999999997E-4,null,1]
[null,250000,{"$f":"IF(#REF!>'taux LOA'!B14,IF(#REF!<'taux LOA'!B15,1,0),0)","v":{"$error":"#REF!"}},5.5920000000000004E-4]
[null,300000,{"$f":"IF(#REF!>'taux LOA'!B15,IF(#REF!<'taux LOA'!B16,1,0),0)","v":{"$error":"#REF!"}},5.5080000000000005E-4]

{"sheet":"trad","index":4,"n_rows":105,"n_cols":11,"rows_kept":105,"cut":false,"hidden":false,"merged":[[0,1,0,4],[0,5,0,8],[0,9,0,12]]}
[null,"Français",null,null,null,"ANGLAIS",null,null,null,"GERMAN"]
[null,"à : ","Demande de devis",null,null,"in : ","Estimate request",null,null,"Ort:","Voranschlag"]
[null,"le : ",null,null,null,"date :",null,null,null,"Datum:"]
[]
[]
[null,"Virgin Mojito 650 QR standard suivant descriptif - Complétez vos coordonnées, sélectionnez les options.",null,null,null,"Virgin Mojito 650  SK according to standard description - Fill in your details and select the desired options (x)",null,null,null,"Virgin Mojito 650  QR Standard folgende Beschreibung - Geben Sie Ihre Daten ein und wählen Sie Optionen aus."]
[null,"Sauvegardez, cliquez sur l'enveloppe pour envoyer à info@idbmarine.com",null,null,null,"Save file and click on the envelope to send to info@idbmarine.com",null,null,null,"Speichern Sie, klicken Sie auf den Umschlag, um ihn an info@idbmarine.com zu senden"]
[null,"Tirant d'eau",null,null,null,"Draft",null,null,null,"Draft"]
[]
[null,"Energie - Propulsion",null,null,null,"Energy - Propulsion",null,null,null,"Energy - Propulsion"]
[null,null,"Kit électrique comprenant : ",null,null,null,"Kit elec with : ",null,null,null,"Kit elec with : "]
[null,null,"                    1 Tableau électrique 5 positions sur disjonteurs",null,null,null,"1 switchboard",null,null,null,"1 switchboard"]
[null,null,"                    1 batterie plomb 60 AH ou convertisseur DC DC",null,null,null,"1 lead battery 60 AH or DC DC Convertor",null,null,null,"1 lead battery 60 AH or DC DC Convertor"]
[null,null,"                    1 coupe circuit",null,null,null,"1 circuit breaker",null,null,null,"1 circuit breaker"]
[null,null,"                    1 plafonnier rouge / blanc",null,null,null,"1 LED Spot LED W/R",null,null,null,"1 LED Spot LED W/R"]
[null,null,"                    1 feux de Nav / Mouillage Tiny en tête de mât",null,null,null,"1 Nav / Anchor LED light Tiny on top of the mast",null,null,null,"1 Nav / Anchor LED light Tiny on top of the mast"]
[null,null,"Moteur thermique Honda 2,5 cv",null,null,null,"Engine HB Honda 2,5 cv",null,null,null,"Engine HB Honda 2,5 cv"]
[null,null,"Moteur thermique Suzuki DF4 avec nourrice",null,null,null,"Engine HB Suzuki DF4 cv with feeder",null,null,null,"Engine HB Suzuki DF4 cv with feeder"]
[null,null,"Moteur HB Torquedo Cruise 2.0 RS + batterie Power 24-3500",null,null,null,"Outboard Torquedo 2,0 RS + Power 24-3500 battery",null,null,null,"Outboard Torquedo 2,0 RS + Power 24-3500 battery"]
[]
[null,"Voiles All Purpose",null,null,null,"All Purpose Sails",null,null,null,"All Purpose Segel"]
[null,"Près",null,null,null,"Upwind",null,null,null,"Upwind"]
[null,null,"Grand voile lattée à corne / 21 m² - CDX6 - 2 Ris auto",null,null,null,"Fulbatten mainsail / 21 m2 - CDX6 - 2 auto reef",null,null,null,"Fulbatten mainsail / 21 m2 - CDX6 - 2 auto reef"]
[null,null,"Solent 110 % - CDX6 - 17 m²",null,null,null,"Genoa 110 % - CDX6 - 17 m2",null,null,null,"Genoa 110 % - CDX6 - 17 m2"]
[null,"Portant",null,null,null,"Downwind",null,null,null,"Downwind"]
[null,null,"Spi assymétrique / 64.00 m² - A2",null,null,null,"Assymetrical spinaker / 64 m2 - A2",null,null,null,"Assymetrical spinaker / 64 m2 - A2"]
[null,null,"Gennaker / 30.00 m²",null,null,null,"Gennaker/ 30.00 m²",null,null,null,"Gennaker/ 30.00 m²"]
[null,"Divers",null,null,null,"Miscellaneous",null,null,null,"Miscellaneous"]
[null,null,"Lazy Bag",null,null,null,"Lazy-bag",null,null,null,"Lazy-bag"]
[null,null,"Taud de GV",null,null,null,"Main cover",null,null,null,"Main cover"]
[]
[null,"Electronique B&G",null,null,null,"B&G Electronics",null,null,null,"B&G Electronics"]
[null,"Centrale TRITON 2",null,null,null,"TRITON 2 Pack",null,null,null,"TRITON 2 Pack"]
[null,null,"Pack loch/sondeur/vent 1 afficheur",null,null,null,"Speed/depht/wind pack, 1 display",null,null,null,"Speed/depht/wind pack, 1 display"]
[null,null,"2 afficheurs supplémentaires",null,null,null,"2 more displays",null,null,null,"2 more displays"]
[null,null,"1 afficheur supplémentaire",null,null,null,"1 more display",null,null,null,"1 more display"]
[null,"Pilote TRITON ",null,null,null,"TRITON  2 pilot system",null,null,null,"TRITON  2 pilot system"]
[null,null,"KIT NAC2 Calculateur NAC2 + Compas précision 7 + rudder FD",null,null,null,"KIT NAC2 + Precision 7 ",null,null,null,"KIT NAC2 + Precision 7 "]
[null,null,"Vérin linéaire mécanique JEFA",null,null,null,"JEFA electrical ram",null,null,null,"JEFA electrical ram"]
[null,null,"Télécommande filaire pilote",null,null,null,"Pilot keypad",null,null,null,"Pilot keypad"]
[null,null,"Télécommande sans fil pilote",null,null,null,"Wireless pilot keypad",null,null,null,"Wireless pilot keypad"]
[null,"Pilote TP",null,null,null,"TP Pilot",null,null,null,"TP Pilot"]
[null,null,"Pilote barre franche TP32",null,null,null,"Tiller pilot TP32",null,null,null,"Tiller pilot TP32"]
[null,"GPS Traceur",null,null,null,"GPS Chartplotter",null,null,null,"GPS Chartplotter"]
[null,null,"Vulcan 7 (incl Wifi + radar)",null,null,null,"Vulcan 7 (incl Wifi + radar)",null,null,null,"Vulcan 7 (incl Wifi + radar)"]
[null,null,"Vulcan 9 (incl Wifi + radar)",null,null,null,"Vulcan 9 (incl Wifi + radar)",null,null,null,"Vulcan 9 (incl Wifi + radar)"]
[null,null,"Carte europe Navionics Gold (N-GOLD_46XG)",null,null,null,"Europe map Navionics Gold (N-GOLD_46XG)",null,null,null,"Europe map Navionics Gold (N-GOLD_46XG)"]
[null,null,"Antenne GPS 10 Hz",null,null,null,"GPS Antenna 10 Hz",null,null,null,"GPS Antenna 10 Hz"]
[null,"AIS classe B (integre antenne GPS - NMEA2000)",null,null,null,"AIS classe B (wih GPS antenna - NMEA2000)",null,null,null,"AIS classe B (wih GPS antenna - NMEA2000)"]
[null,null,"AIS TR-210 Advansea",null,null,null,"AIS TR-210 Advansea",null,null,null,"AIS TR-210 Advansea"]
[null,null,"Splitter Advansea",null,null,null,"Splitter Advansea",null,null,null,"Splitter Advansea"]
[null,"Accessoires",null,null,null,"Accessories",null,null,null,"Accessories"]
[null,null,"cable microc-microc 5 m",null,null,null,"cable microc-microc 5 m",null,null,null,"cable microc-microc 5 m"]
[null,null,"cable microc-microc 2 m",null,null,null,"cable microc-microc 2 m",null,null,null,"cable microc-microc 2 m"]
[null,null,"Kit NMEA 2000",null,null,null,"Kit NMEA 2000",null,null,null,"Kit NMEA 2000"]
[null,"Communications",null,null,null,"Communications",null,null,null,"Communications"]
[null,null,"VHF V60 DSC AIS/GPS",null,null,null,"VHF V60 DSC AIS/GPS",null,null,null,"VHF V60 DSC AIS/GPS"]
[null,null,"VHF V20 DSC/GPS",null,null,null,"VHF V20 DSC/GPS",null,null,null,"VHF V20 DSC/GPS"]
[null,null,"cable VHF1720 30 m",null,null,null,"VHF1720 cable 30 m",null,null,null,"VHF1720 cable 30 m"]
[null,null,"Antenne fouet 1720",null,null,null,"VHF Antena1720",null,null,null,"VHF Antena1720"]
[]
[null,"Equipements / Divers",null,null,null,"Equipments",null,null,null,"Komfort"]
[null,null,"Béquilles télescopiques",null,null,null,"sealegs",null,null,null,"Wattstützen"]
[null,null,"Enrouleur FD 110",null,null,null,"Flatdeck furling system FD110",null,null,null,"Flatdeck furling system FD110"]
[null,null,"Emmagasineur facnor Fx1500",null,null,null,"Facnor roller Fx1500",null,null,null,"Facnor roller Fx1500"]
[null,null,"Emmagasineur Karver KF 1,5",null,null,null,"Karver roller 1,5",null,null,null,"Karver roller 1,5"]
[null,null,"2 winchs Karver KCW45 aulieu de 3 winchs Harken Radial20 Alu",null,null,null,"2 karver KCW45 instead of 3 Harken R20",null,null,null,"2 karver KCW45 instead of 3 Harken R20"]
[null,null,"Mat + bôme carbone",null,null,null,"Carbon mast & boom",null,null,null,"Carbon mast & boom"]
[null,null,"Jupe arrière (40 cm) avec chaise moteur intégrée et echelle de bain",null,null,null,"Aft extension hull with integrated HB Motor support & bathing ladder",null,null,null,"Aft extension hull with integrated HB Motor support"]
[null,null,"Kit armement côtier",null,null,null,"Inshore Safety Pack ",null,null,null,"Inshore Safety Pack "]
[null,null,"Kit armement semi-hauturier",null,null,null,"Offshore Safety Pack (<60')",null,null,null,"Offshore Safety Pack (<60')"]
[null,null,"Kit Emménagements Week End",null,null,null,"Week-End accomodation Kit",null,null,null,"Week-End accomodation Kit"]
[null,null,"Table de carré avec deux abattants",null,null,null," Saloon table with 2 folding seats",null,null,null," Saloon table with 2 folding seats"]
[null,null,"Selleries de couchage AV et AR",null,null,null,"Mattress for forward double berth and aft single berths",null,null,null,"Mattress for forward double berth and aft single berths"]
[null,null,"Kit Emménagements Croisière",null,null,null,"Cruising accomodation Kit",null,null,null,"Cruising accomodation Kit"]
[null,null,"Module cuisine (évier + réchaud 1 feu)",null,null,null,"Kitchen module (1 sink  + 1 gaz cooker (1 burn))",null,null,null,"Kitchen module (1 sink  + 1 gaz cooker (1 burn))"]
[null,null,"WC Chimique",null,null,null,"Freshwater tank - manual pump - Chimical toilets",null,null,null,"Freshwater tank - manual pump - Chimical toilets"]
[null," ","Kit Outils Océan : voir onglet OO",null,null," ","Outils Ocean Kit (see sheet OO)",null,null," ","Outils Ocean Kit (see sheet OO)"]
[null,null,"Chaise moteur HB sur tableau AR",null,null,null,"HB motor chair",null,null,null,"HB motor chair"]
[null,null,"Coque couleur (adhésif)",null,null,null,"Hull color (adhesive)",null,null,null,"Rumpf farbig (adhesiv)"]
[null,null,"Préparation carène (Primaire + AF érodable)",null,null,null,"Hull antifouling sprayed ",null,null,null,"Unterwasserschiff: Antifouling gespritzt"]
[null,null,"Préparation carène (Coppercoat)",null,null,null,"Coppercoat sprayed ",null,null,null,"Unterwasserschiff: Coppercoat gespritzt"]
[null,null,"Remorque Mécanorem pour Mojito 650 (avec conformateurs)",null,null,null,"Mecanorem trailer (with shape holders)",null,null,null,"BOMBARD AX2 Aero Beiboot 2.40 m HP boden"]
[null,null,"Remorque portuaire Mécanorem pour Mojito 650 (avec conformateurs)",null,null,null,"Harbour Mecanorem trailer (with shape holders)",null,null,null,"BOMBARD AX2 Aero Beiboot 2.40 m HP boden"]
[null,null,"Chargement et sanglage bateau + mât sur remorque Mojito 650",null,null,null,"Preparation of the boat for road transportation on her trailer",null,null,null,"Preparation of the boat for road transportation on her trailer"]
[null,null,"Mise à l'eau & mâtage (à Concarneau)",null,null,null,"Launching & masting (in Trégunc)",null,null,null,"Einwassern & Mast stellen (in Trégunc)"]
[null,null,"Essai sous voiles (1 journée)",null,null,null,"Sail test (1 day)",null,null,null,"Sail test (1 day)"]
[null,null,"Participation eco conception (%)",null,null,null,"Participation eco conception ( %)",null,null,null,"Beteiligung eco conception (%)"]
[null,null,"Frais d'immatriculation (hors cout francisation)",null,null,null,"Registration fees",null,null,null,"Anmeldegebühren"]
[]
[]
[]
[null,null,"Monsieur :",null,null,null,"Mister :",null,null,null,"Herr/Frau:"]
[null,null,"Adresse : ",null,null,null,"Address :",null,null,null,"Adresse:"]
[null,null,"Tel : ",null,null,null,"Phone N° :",null,null,null,"Telephon-Nr:"]
[null,null,"Email : ",null,null,null,"Mail : ",null,null,null,"Mail: "]
[null,null,"Votre bateau :",null,null,null,"Your sailboat :",null,null,null,"dein Boot :"]
[null,null,"Port d'attache :",null,null,null,"Harbour :",null,null,null,"Heimathafen :"]
[]
[null,null,"Équipements optionnels ( pose comprise)",null,null,null,"Optional equipment ( mounting included)",null,null,null,"Optionen (einschl. Einbau)"]
[null,null,"commentaire / question",null,null,null,"comment / question",null,null,null,"Anmerkung / Frage"]
[null,null,"nécessité",null,null,null,"must have",null,null,null,"muss sein"]
[null,null,"agréable d'avoir",null,null,null,"nice to have",null,null,null,"kann sein"]
[]
[null,null,"Devis valable 1 mois à compter de la date mentionnée",null,null,null,"Estimate valid for 1 month from the date mentioned",null,null,null,"Voranschlag gültig für 1 Monat ab dem genannten Datum"]

{"sheet":"indices","index":5,"n_rows":20,"n_cols":6,"rows_kept":20,"cut":false,"hidden":true,"merged":[]}
[]
[]
[]
[]
[null,null,"Devis N°","Date","Montant Options","Remarques"]
[null,null,"001"]
[null,null,"002"]
[null,null,"003"]
[null,null,"004"]
[null,null,"005"]
[null,null,"006"]
[null,null,"007"]
[null,null,"008"]
[null,null,"009"]
[null,null,"010"]
[]
[]
[]
[null,null,"chèque"]
[null,null,"virement"]